{"text_format":"3","workbook":"xlsx","n_sheets":4,"sheets":["市专精特新","省专精特新","省专精特新冠军","国家专精特新“小巨人”"],"not_rendered":{"defined_names":5},"read":"whole","date_system":"1900"}

{"sheet":"市专精特新","index":0,"n_rows":185,"n_cols":7,"rows_kept":185,"merged":[[0,0,0,5]]}
["马鞍山市专精特新企业名单"]
["序号","企业名称","所属辖区","评选年度","是否是省“专精特新”","是否出库"]
[1,"安徽慕曼德家具有限公司","含山县",2018,"是","是",{"$f":"IFERROR(VLOOKUP(B3,#REF!,1,FALSE),\"\")","v":""}]
[2,"安徽朗迪叶轮机械有限公司","含山县",2018,"是","是",{"$f":"IFERROR(VLOOKUP(B4,#REF!,1,FALSE),\"\")","v":""}]
[3,"安徽省亚欧陶瓷有限责任公司","含山县",2018,"是","是",{"$f":"IFERROR(VLOOKUP(B5,#REF!,1,FALSE),\"\")","v":""}]
[4,"马鞍山市康辉纸箱纸品有限公司","含山县",2018,"是","是",{"$f":"IFERROR(VLOOKUP(B6,#REF!,1,FALSE),\"\")","v":""}]
[5,"含山县大兴金属制品有限公司","含山县",2019,"是","是",{"$f":"IFERROR(VLOOKUP(B7,#REF!,1,FALSE),\"\")","v":""}]
[6,"含山县大力精密机械有限公司","含山县",2019,"否","是",{"$f":"IFERROR(VLOOKUP(B8,#REF!,1,FALSE),\"\")","v":""}]
[7,"含山县朝霞铸造有限公司","含山县",2019,"是","是",{"$f":"IFERROR(VLOOKUP(B9,#REF!,1,FALSE),\"\")","v":""}]
[8,"安徽国能亿盛环保科技有限公司","含山县",2020,"否","是",{"$f":"IFERROR(VLOOKUP(B10,#REF!,1,FALSE),\"\")","v":""}]
[9,"安徽方信立华环保科技有限公司","含山县",2020,"是","是",{"$f":"IFERROR(VLOOKUP(B11,#REF!,1,FALSE),\"\")","v":""}]
[10,"安徽普瑞普勒传热技术有限公司","含山县",2020,"是","是",{"$f":"IFERROR(VLOOKUP(B12,#REF!,1,FALSE),\"\")","v":""}]
[11,"安徽宏华铸造有限公司","含山县",2021,null,"是"]
[12,"安徽省飞龙新型材料有限公司","含山县",2021,"是","是"]
[13,"安徽省含山县兴建铸造厂","含山县",2021,null,"是"]
[14,"安徽可尔海思塑业有限公司","含山县",2021,null,"是"]
[15,"安徽容纳新能源科技有限公司","含山县",2021,null,"是"]
[16,"安徽顺达环保科技股份有限公司","含山县",2021,null,"是"]
[17,"安徽大来机械制造有限公司","含山县",2021,null,"是"]
[18,"安徽国宏合金材料有限公司","含山县",2021,null,"是"]
[19,"安徽恒钛智能制造有限公司","含山县",2021,null,"是"]
[20,"和县晶晶玻璃制品有限公司","和县",2018,"是","是",{"$f":"IFERROR(VLOOKUP(B22,#REF!,1,FALSE),\"\")","v":""}]
[21,"安徽同心化工有限公司","和县",2018,"是","是",{"$f":"IFERROR(VLOOKUP(B23,#REF!,1,FALSE),\"\")","v":""}]
[22,"安徽禾臣新材料有限公司","和县",2019,"是","是",{"$f":"IFERROR(VLOOKUP(B24,#REF!,1,FALSE),\"\")","v":""}]
[23,"安徽硅宝有机硅新材料有限公司","和县",2019,"是","是",{"$f":"IFERROR(VLOOKUP(B25,#REF!,1,FALSE),\"\")","v":""}]
[24,"安徽悠之优味食品有限公司","和县",2019,"是","是",{"$f":"IFERROR(VLOOKUP(B26,#REF!,1,FALSE),\"\")","v":""}]
[25,"安徽索立德铸业有限公司","和县",2019,"否","是",{"$f":"IFERROR(VLOOKUP(B27,#REF!,1,FALSE),\"\")","v":""}]
[26,"安徽星宇化工有限公司","和县",2019,"是","是",{"$f":"IFERROR(VLOOKUP(B28,#REF!,1,FALSE),\"\")","v":""}]
[27,"和县明生环保材料有限责任公司","和县",2019,"是","是",{"$f":"IFERROR(VLOOKUP(B29,#REF!,1,FALSE),\"\")","v":""}]
[28,"马鞍山市十月丰食品有限公司","和县",2020,"否","是",{"$f":"IFERROR(VLOOKUP(B30,#REF!,1,FALSE),\"\")","v":""}]
[29,"安徽以诺木塑板材科技有限公司","和县",2020,"否","是",{"$f":"IFERROR(VLOOKUP(B31,#REF!,1,FALSE),\"\")","v":""}]
[30,"安徽同盛重型装备有限公司","和县",2021,null,"是"]
[31,"安徽三竹智能科技股份有限公司","和县",2021,null,"是"]
[32,"艾仕得绝缘材料（安徽）有限公司","和县",2021,"是","是"]
[33,"安徽钦同瓶业有限公司","和县",2021,null,"是"]
[34,"安徽永安低碳环保科技有限公司","和县",2021,"是","是"]
[35,"马鞍山市浩宇仪表有限公司","当涂县",2018,"否","是",{"$f":"IFERROR(VLOOKUP(B37,#REF!,1,FALSE),\"\")","v":""}]
[36,"马鞍山祥恒包装有限公司","当涂县",2018,"是","是",{"$f":"IFERROR(VLOOKUP(B38,#REF!,1,FALSE),\"\")","v":""}]
[37,"马鞍山市天睿实业有限公司","当涂县",2018,"是","是",{"$f":"IFERROR(VLOOKUP(B39,#REF!,1,FALSE),\"\")","v":""}]
[38,"安徽天锦云节能防水科技有限公司","当涂县",2018,"是","是",{"$f":"IFERROR(VLOOKUP(B40,#REF!,1,FALSE),\"\")","v":""}]
[39,"安徽省力通稀土钢缆有限公司","当涂县",2018,"是","是",{"$f":"IFERROR(VLOOKUP(B41,#REF!,1,FALSE),\"\")","v":""}]
[40,"马鞍山福亨汽车内饰有限公司","当涂县",2018,"是","是",{"$f":"IFERROR(VLOOKUP(B42,#REF!,1,FALSE),\"\")","v":""}]
[41,"安徽环宇铝业有限公司","当涂县",2018,"是","是",{"$f":"IFERROR(VLOOKUP(B43,#REF!,1,FALSE),\"\")","v":""}]
[42,"马鞍山市粤美金属制品科技实业有限公司","当涂县",2018,"是","是",{"$f":"IFERROR(VLOOKUP(B44,#REF!,1,FALSE),\"\")","v":""}]
[43,"马鞍山市金港冶金材料有限公司","当涂县",2018,"否","是",{"$f":"IFERROR(VLOOKUP(B45,#REF!,1,FALSE),\"\")","v":""}]
[44,"马鞍山市鑫龙特钢有限公司","当涂县",2018,"是","是",{"$f":"IFERROR(VLOOKUP(B46,#REF!,1,FALSE),\"\")","v":""}]
[45,"马鞍山市万鑫铸造有限公司","当涂县",2018,"是","是",{"$f":"IFERROR(VLOOKUP(B47,#REF!,1,FALSE),\"\")","v":""}]
[46,"马鞍山市德善金属成型科技有限公司","当涂县",2019,"是","是",{"$f":"IFERROR(VLOOKUP(B48,#REF!,1,FALSE),\"\")","v":""}]
[47,"安徽福马电子科技有限公司","当涂县",2019,"否","是",{"$f":"IFERROR(VLOOKUP(B49,#REF!,1,FALSE),\"\")","v":""}]
[48,"马鞍山天福康药业有限公司","当涂县",2019,"是","是",{"$f":"IFERROR(VLOOKUP(B50,#REF!,1,FALSE),\"\")","v":""}]
[49,"马鞍山起劲磁塑科技有限公司","当涂县",2019,"否","是",{"$f":"IFERROR(VLOOKUP(B51,#REF!,1,FALSE),\"\")","v":""}]
[50,"安徽省佳艺休闲用品有限公司","当涂县",2019,"否","是",{"$f":"IFERROR(VLOOKUP(B52,#REF!,1,FALSE),\"\")","v":""}]
[51,"马鞍山北光冶金机械有限责任公司","当涂县",2019,"是","是",{"$f":"IFERROR(VLOOKUP(B53,#REF!,1,FALSE),\"\")","v":""}]
[52,"马鞍山江心绿洲食品有限公司","当涂县",2019,"是","是",{"$f":"IFERROR(VLOOKUP(B54,#REF!,1,FALSE),\"\")","v":""}]
[53,"安徽长江精细硅粉有限责任公司","当涂县",2020,"是","是",{"$f":"IFERROR(VLOOKUP(B55,#REF!,1,FALSE),\"\")","v":""}]
[54,"安徽天沃重工机械有限公司","当涂县",2020,"否","是",{"$f":"IFERROR(VLOOKUP(B56,#REF!,1,FALSE),\"\")","v":""}]
[55,"马鞍山久泰渔具有限公司","当涂县",2020,"否","是",{"$f":"IFERROR(VLOOKUP(B57,#REF!,1,FALSE),\"\")","v":""}]
[56,"安徽雷默模具制造有限公司","当涂县",2021,null,"是"]
[57,"马鞍山市华能电力线路器材有限责任公司","当涂县",2021,null,"是"]
[58,"马鞍山市中桥金属材料有限公司","当涂县",2021,null,"是"]
[59,"马鞍山三塔环保科技有限公司","当涂县",2021,"是","是"]
[60,"马鞍山精一工程机械有限公司","当涂县",2021,null,"是"]
[61,"安徽省中测电子科技有限公司","当涂县",2021,"是","是"]
[62,"安徽鑫磁源磁业有限公司","当涂县",2021,null,"是"]
[63,"马鞍山宏瑞金属制品有限公司","当涂县",2021,"是","是"]
[64,"马鞍山虹润彩印有限责任公司","当涂县",2021,null,"是"]
[65,"马鞍山市思迪包装材料科技有限公司","当涂县",2021,null,"是"]
[66,"安徽金禾软件股份有限公司","花山区",2018,"是","是",{"$f":"IFERROR(VLOOKUP(B68,#REF!,1,FALSE),\"\")","v":""}]
[67,"马鞍山琢学网络科技有限公司","花山区",2018,"是","是",{"$f":"IFERROR(VLOOKUP(B69,#REF!,1,FALSE),\"\")","v":""}]
[68,"马鞍山市新华异型钢开发有限责任公司","花山区",2019,"否","是",{"$f":"IFERROR(VLOOKUP(B70,#REF!,1,FALSE),\"\")","v":""}]
[69,"安徽马钢嘉华新型建材有限公司","花山区",2020,"是","是",{"$f":"IFERROR(VLOOKUP(B71,#REF!,1,FALSE),\"\")","v":""}]
[70,"马鞍山市华源新材料科技有限公司","花山区",2020,"否","是",{"$f":"IFERROR(VLOOKUP(B72,#REF!,1,FALSE),\"\")","v":""}]
[71,"安徽意尔涂料制造有限公司","花山区",2021,null,"是"]
[72,"中钢集团安徽天源科技股份有限公司","雨山区",2018,"是","是",{"$f":"IFERROR(VLOOKUP(B74,#REF!,1,FALSE),\"\")","v":""}]
[73,"安徽黄河水处理科技股份有限公司","雨山区",2018,"是","是",{"$f":"IFERROR(VLOOKUP(B75,#REF!,1,FALSE),\"\")","v":""}]
[74,"安徽旗翔科技发展有限公司","雨山区",2018,"是","是",{"$f":"IFERROR(VLOOKUP(B76,#REF!,1,FALSE),\"\")","v":""}]
[75,"安徽昱工耐磨材料科技有限公司","雨山区",2018,"是","是",{"$f":"IFERROR(VLOOKUP(B77,#REF!,1,FALSE),\"\")","v":""}]
[76,"安徽沪宁智能科技有限公司","雨山区",2018,"否","是",{"$f":"IFERROR(VLOOKUP(B78,#REF!,1,FALSE),\"\")","v":""}]
[77,"马鞍山甬兴模塑有限公司","雨山区",2018,"是","是",{"$f":"IFERROR(VLOOKUP(B79,#REF!,1,FALSE),\"\")","v":""}]
[78,"马鞍山瑞辉实业有限公司","雨山区",2018,"否","是",{"$f":"IFERROR(VLOOKUP(B80,#REF!,1,FALSE),\"\")","v":""}]
[79,"金雪驰科技（马鞍山）有限公司","雨山区",2018,"是","是",{"$f":"IFERROR(VLOOKUP(B81,#REF!,1,FALSE),\"\")","v":""}]
[80,"马鞍山奥柯环保科技发展有限公司","雨山区",2019,"是","是",{"$f":"IFERROR(VLOOKUP(B82,#REF!,1,FALSE),\"\")","v":""}]
[81,"马鞍山市华科实业有限公司","雨山区",2019,"否","是",{"$f":"IFERROR(VLOOKUP(B83,#REF!,1,FALSE),\"\")","v":""}]
[82,"安徽省爱夫卡电子科技有限公司","雨山区",2020,"是","是",{"$f":"IFERROR(VLOOKUP(B84,#REF!,1,FALSE),\"\")","v":""}]
[83,"安徽晨光高耐磨科技股份有限公司","雨山区",2020,"是","是",{"$f":"IFERROR(VLOOKUP(B85,#REF!,1,FALSE),\"\")","v":""}]
[84,"瑞泰马钢新材料科技有限公司","雨山区",2020,"否","是",{"$f":"IFERROR(VLOOKUP(B86,#REF!,1,FALSE),\"\")","v":""}]
[85,"安徽斯塔克机器人有限公司","雨山区",2021,"是","是"]
[86,"马鞍山康福塑料制品有限公司","雨山区",2021,null,"是"]
[87,"安徽中马磁能科技股份有限公司","雨山区",2021,null,"是"]
[88,"安徽祥云科技有限公司","雨山区",2021,null,"是"]
[89,"安徽港泰机械制造集团有限公司","雨山区",2021,"是","是"]
[90,"安徽载盛新材料有限公司","雨山区",2021,null,"是"]
[91,"埃斯科特钢有限公司","雨山区",2021,null,"是"]
[92,"马鞍山旭阳机械有限公司","博望区",2018,"是","是",{"$f":"IFERROR(VLOOKUP(B94,#REF!,1,FALSE),\"\")","v":""}]
[93,"马鞍山市国菱机械刃模有限公司","博望区",2018,"否","是",{"$f":"IFERROR(VLOOKUP(B95,#REF!,1,FALSE),\"\")","v":""}]
[94,"安徽长江机床制造（集团）有限公司","博望区",2018,"是","是",{"$f":"IFERROR(VLOOKUP(B96,#REF!,1,FALSE),\"\")","v":""}]
[95,"安徽哈科数控机床制造有限公司","博望区",2018,"是","是",{"$f":"IFERROR(VLOOKUP(B97,#REF!,1,FALSE),\"\")","v":""}]
[96,"安徽金大进重工机床有限公司","博望区",2018,"是","是",{"$f":"IFERROR(VLOOKUP(B98,#REF!,1,FALSE),\"\")","v":""}]
[97,"安徽嘉龙锋钢刀具有限公司","博望区",2018,"是","是",{"$f":"IFERROR(VLOOKUP(B99,#REF!,1,FALSE),\"\")","v":""}]
[98,"马鞍山市华东耐磨合金有限公司","博望区",2018,"否","是",{"$f":"IFERROR(VLOOKUP(B100,#REF!,1,FALSE),\"\")","v":""}]
[99,"马鞍山市中冶机械有限责任公司","博望区",2018,"是","是",{"$f":"IFERROR(VLOOKUP(B101,#REF!,1,FALSE),\"\")","v":""}]
[100,"马鞍山市华达冶金机械有限公司","博望区",2018,"是","是",{"$f":"IFERROR(VLOOKUP(B102,#REF!,1,FALSE),\"\")","v":""}]
[101,"安徽太平洋重型机器股份有限公司","博望区",2018,"是","是",{"$f":"IFERROR(VLOOKUP(B103,#REF!,1,FALSE),\"\")","v":""}]
[102,"马鞍山市中亚机床制造有限公司","博望区",2019,"是","是",{"$f":"IFERROR(VLOOKUP(B104,#REF!,1,FALSE),\"\")","v":""}]
[103,"安徽中瑞机床制造有限公司","博望区",2019,"是","是",{"$f":"IFERROR(VLOOKUP(B105,#REF!,1,FALSE),\"\")","v":""}]
[104,"安徽百超激光科技有限公司","博望区",2019,"是","是",{"$f":"IFERROR(VLOOKUP(B106,#REF!,1,FALSE),\"\")","v":""}]
[105,"安徽日升机械制造有限公司","博望区",2020,"是","是",{"$f":"IFERROR(VLOOKUP(B107,#REF!,1,FALSE),\"\")","v":""}]
[106,"安徽锋利锐刀片制造有限公司","博望区",2020,"否","是",{"$f":"IFERROR(VLOOKUP(B108,#REF!,1,FALSE),\"\")","v":""}]
[107,"马鞍山市庄芝耐磨合金有限公司","博望区",2020,"否","是",{"$f":"IFERROR(VLOOKUP(B109,#REF!,1,FALSE),\"\")","v":""}]
[108,"马鞍山市恒泰重工机械有限公司","博望区",2021,null,"是"]
[109,"安徽中意机床制造有限公司","博望区",2021,null,"是"]
[110,"安徽东海裕祥智能装备科技有限公司","博望区",2021,null,"是"]
[111,"马鞍山市华威冶金机械有限公司","博望区",2021,null,"是"]
[112,"安徽马钢比亚西钢筋焊网有限公司","市经开区",2018,"是","是",{"$f":"IFERROR(VLOOKUP(B114,#REF!,1,FALSE),\"\")","v":""}]
[113,"马鞍山邦德医疗器械有限公司","市经开区",2018,"是","是",{"$f":"IFERROR(VLOOKUP(B115,#REF!,1,FALSE),\"\")","v":""}]
[114,"安徽科达机电有限公司","市经开区",2018,"是","是",{"$f":"IFERROR(VLOOKUP(B116,#REF!,1,FALSE),\"\")","v":""}]
[115,"马鞍山晶宇能源科技有限公司","市经开区",2018,"是","是",{"$f":"IFERROR(VLOOKUP(B117,#REF!,1,FALSE),\"\")","v":""}]
[116,"中钢集团马鞍山矿院新材料科技有限公司","市经开区",2018,"是","是",{"$f":"IFERROR(VLOOKUP(B118,#REF!,1,FALSE),\"\")","v":""}]
[117,"马鞍山焓谷能源审计有限公司","市经开区",2018,"否","是",{"$f":"IFERROR(VLOOKUP(B119,#REF!,1,FALSE),\"\")","v":""}]
[118,"马鞍山统力回转支承有限公司","经开区",2019,"是","是",{"$f":"IFERROR(VLOOKUP(B120,#REF!,1,FALSE),\"\")","v":""}]
{"$rows_left_out":66}
{"sheet":"省专精特新","index":1,"n_rows":199,"n_cols":5,"rows_kept":199,"merged":[[0,0,0,3]]}
["安徽省专精特新中小企业名单"]
["序号","企业名称","所在\n市、县（区）","评选年度"]
[1,"同兴环保科技股份有限公司","含山县",2013,{"$f":"IFERROR(VLOOKUP(B3,#REF!,1,FALSE),\"\")","v":""}]
[2,"安徽省含山民生瓷业有限责任公司","含山县",2014,{"$f":"IFERROR(VLOOKUP(B4,#REF!,1,FALSE),\"\")","v":""}]
[3,"安徽大平油脂有限公司","含山县",2014,{"$f":"IFERROR(VLOOKUP(B5,#REF!,1,FALSE),\"\")","v":""}]
[4,"安徽威达环保科技股份有限公司","含山县",2014,{"$f":"IFERROR(VLOOKUP(B6,#REF!,1,FALSE),\"\")","v":""}]
[5,"安徽青花坊瓷业股份有限公司","含山县",2015,{"$f":"IFERROR(VLOOKUP(B7,#REF!,1,FALSE),\"\")","v":""}]
[6,"安徽威龙电力器材有限公司","含山县",2016,{"$f":"IFERROR(VLOOKUP(B8,#REF!,1,FALSE),\"\")","v":""}]
[7,"含山瑞可金属有限公司","含山县",2017,{"$f":"IFERROR(VLOOKUP(B9,#REF!,1,FALSE),\"\")","v":""}]
[8,"安徽天顺环保设备股份有限公司","含山县",2017,{"$f":"IFERROR(VLOOKUP(B10,#REF!,1,FALSE),\"\")","v":""}]
[9,"安徽锦华氧化锌有限公司","含山县",2017,{"$f":"IFERROR(VLOOKUP(B11,#REF!,1,FALSE),\"\")","v":""}]
[10,"马鞍山市三川机械制造有限公司","含山县",2017,{"$f":"IFERROR(VLOOKUP(B12,#REF!,1,FALSE),\"\")","v":""}]
[11,"安徽海立精密铸造有限公司","含山县",2017,{"$f":"IFERROR(VLOOKUP(B13,#REF!,1,FALSE),\"\")","v":""}]
[12,"安徽慕曼德家具有限公司","含山县",2018,{"$f":"IFERROR(VLOOKUP(B14,#REF!,1,FALSE),\"\")","v":""}]
[13,"安徽朗迪叶轮机械有限公司","含山县",2018,{"$f":"IFERROR(VLOOKUP(B15,#REF!,1,FALSE),\"\")","v":""}]
[14,"安徽省亚欧陶瓷有限责任公司","含山县",2018,{"$f":"IFERROR(VLOOKUP(B16,#REF!,1,FALSE),\"\")","v":""}]
[15,"含山县大兴金属制品有限公司","含山县",2019,{"$f":"IFERROR(VLOOKUP(B17,#REF!,1,FALSE),\"\")","v":""}]
[16,"含山县朝霞铸造有限公司","含山县",2019,{"$f":"IFERROR(VLOOKUP(B18,#REF!,1,FALSE),\"\")","v":""}]
[17,"安徽方信立华环保科技有限公司","含山县",2021,{"$f":"IFERROR(VLOOKUP(B19,#REF!,1,FALSE),\"\")","v":""}]
[18,"安徽省飞龙新型材料有限公司","含山县",2021,{"$f":"IFERROR(VLOOKUP(B20,#REF!,1,FALSE),\"\")","v":""}]
[19,"安徽普瑞普勒传热技术有限公司","含山县",2021,{"$f":"IFERROR(VLOOKUP(B21,#REF!,1,FALSE),\"\")","v":""}]
[20,"马鞍山市康辉纸箱纸品有限公司","含山县",2021,{"$f":"IFERROR(VLOOKUP(B22,#REF!,1,FALSE),\"\")","v":""}]
[21,"三联泵业股份有限公司","和县",2013,{"$f":"IFERROR(VLOOKUP(B23,#REF!,1,FALSE),\"\")","v":""}]
[22,"安徽久工健业有限责任公司","和县",2014,{"$f":"IFERROR(VLOOKUP(B24,#REF!,1,FALSE),\"\")","v":""}]
[23,"安徽华安食品有限公司","和县",2014,{"$f":"IFERROR(VLOOKUP(B25,#REF!,1,FALSE),\"\")","v":""}]
[24,"安徽宏晶新材料股份有限公司","和县",2015,{"$f":"IFERROR(VLOOKUP(B26,#REF!,1,FALSE),\"\")","v":""}]
[25,"安徽大明汽车零部件有限公司","和县",2015,{"$f":"IFERROR(VLOOKUP(B27,#REF!,1,FALSE),\"\")","v":""}]
[26,"安徽三才体育用品有限公司","和县",2016,{"$f":"IFERROR(VLOOKUP(B28,#REF!,1,FALSE),\"\")","v":""}]
[27,"和县科嘉阀门铸造有限公司","和县",2016,{"$f":"IFERROR(VLOOKUP(B29,#REF!,1,FALSE),\"\")","v":""}]
[28,"安徽鸡笼山食品有限公司","和县",2016,{"$f":"IFERROR(VLOOKUP(B30,#REF!,1,FALSE),\"\")","v":""}]
[29,"安徽华飞机械铸锻有限公司","和县",2017,{"$f":"IFERROR(VLOOKUP(B31,#REF!,1,FALSE),\"\")","v":""}]
[30,"安徽绿风环保节能材料有限公司","和县",2017,{"$f":"IFERROR(VLOOKUP(B32,#REF!,1,FALSE),\"\")","v":""}]
[31,"安徽同心新材料科技有限公司","和县",2018,{"$f":"IFERROR(VLOOKUP(B33,#REF!,1,FALSE),\"\")","v":""}]
[32,"和县明生环保材料有限责任公司","和县",2019,{"$f":"IFERROR(VLOOKUP(B34,#REF!,1,FALSE),\"\")","v":""}]
[33,"安徽悠之优味食品有限公司","和县",2019,{"$f":"IFERROR(VLOOKUP(B35,#REF!,1,FALSE),\"\")","v":""}]
[34,"安徽硅宝有机硅新材料有限公司","和县",2019,{"$f":"IFERROR(VLOOKUP(B36,#REF!,1,FALSE),\"\")","v":""}]
[35,"和县晶晶玻璃制品有限公司","和县",2019,{"$f":"IFERROR(VLOOKUP(B37,#REF!,1,FALSE),\"\")","v":""}]
[36,"安徽禾臣新材料有限公司","和县",2020,{"$f":"IFERROR(VLOOKUP(B38,#REF!,1,FALSE),\"\")","v":""}]
[37,"艾仕得绝缘材料（安徽）有限公司","和县",2021,{"$f":"IFERROR(VLOOKUP(B39,#REF!,1,FALSE),\"\")","v":""}]
[38,"安徽星宇化工有限公司","和县",2021,{"$f":"IFERROR(VLOOKUP(B40,#REF!,1,FALSE),\"\")","v":""}]
[39,"安徽永安低碳环保科技有限公司","和县",2021,{"$f":"IFERROR(VLOOKUP(B41,#REF!,1,FALSE),\"\")","v":""}]
[40,"马鞍山采石矶涂料有限公司","当涂县",2013,{"$f":"IFERROR(VLOOKUP(B42,#REF!,1,FALSE),\"\")","v":""}]
[41,"金菜地食品股份有限公司","当涂县",2014,{"$f":"IFERROR(VLOOKUP(B43,#REF!,1,FALSE),\"\")","v":""}]
[42,"安徽福马汽车零部件集团有限公司","当涂县",2015,{"$f":"IFERROR(VLOOKUP(B44,#REF!,1,FALSE),\"\")","v":""}]
[43,"马鞍山湖滨无纺布科技有限公司","当涂县",2015,{"$f":"IFERROR(VLOOKUP(B45,#REF!,1,FALSE),\"\")","v":""}]
[44,"马鞍山市广源法兰环件有限公司","当涂县",2015,{"$f":"IFERROR(VLOOKUP(B46,#REF!,1,FALSE),\"\")","v":""}]
[45,"马鞍山经纬回转支承有限公司","当涂县",2016,{"$f":"IFERROR(VLOOKUP(B47,#REF!,1,FALSE),\"\")","v":""}]
[46,"马鞍山科邦生态肥有限公司","当涂县",2016,{"$f":"IFERROR(VLOOKUP(B48,#REF!,1,FALSE),\"\")","v":""}]
[47,"安徽桑瑞斯环保新材料有限公司","当涂县",2016,{"$f":"IFERROR(VLOOKUP(B49,#REF!,1,FALSE),\"\")","v":""}]
[48,"安徽伏斯特智能科技股份有限公司","当涂县",2017,{"$f":"IFERROR(VLOOKUP(B50,#REF!,1,FALSE),\"\")","v":""}]
[49,"安徽正方生物科技有限公司","当涂县",2017,{"$f":"IFERROR(VLOOKUP(B51,#REF!,1,FALSE),\"\")","v":""}]
[50,"安徽瑞邦生物科技有限公司","当涂县",2017,{"$f":"IFERROR(VLOOKUP(B52,#REF!,1,FALSE),\"\")","v":""}]
[51,"安徽盛达前亮铝业有限公司","当涂县",2017,{"$f":"IFERROR(VLOOKUP(B53,#REF!,1,FALSE),\"\")","v":""}]
[52,"安徽超美化工科技有限公司","当涂县",2017,{"$f":"IFERROR(VLOOKUP(B54,#REF!,1,FALSE),\"\")","v":""}]
[53,"马鞍山利元实业有限公司","当涂县",2017,{"$f":"IFERROR(VLOOKUP(B55,#REF!,1,FALSE),\"\")","v":""}]
[54,"马鞍山市常立发机械制造有限公司","当涂县",2017,{"$f":"IFERROR(VLOOKUP(B56,#REF!,1,FALSE),\"\")","v":""}]
[55,"马鞍山市恒欣减压器制造有限公司","当涂县",2017,{"$f":"IFERROR(VLOOKUP(B57,#REF!,1,FALSE),\"\")","v":""}]
[56,"马鞍山祥恒包装有限公司","当涂县",2018,{"$f":"IFERROR(VLOOKUP(B58,#REF!,1,FALSE),\"\")","v":""}]
[57,"马鞍山市天睿实业有限公司","当涂县",2018,{"$f":"IFERROR(VLOOKUP(B59,#REF!,1,FALSE),\"\")","v":""}]
[58,"安徽天锦云节能防水科技有限公司","当涂县",2018,{"$f":"IFERROR(VLOOKUP(B60,#REF!,1,FALSE),\"\")","v":""}]
[59,"安徽省力通稀土钢缆有限公司","当涂县",2018,{"$f":"IFERROR(VLOOKUP(B61,#REF!,1,FALSE),\"\")","v":""}]
[60,"马鞍山福亨汽车内饰有限公司","当涂县",2018,{"$f":"IFERROR(VLOOKUP(B62,#REF!,1,FALSE),\"\")","v":""}]
[61,"安徽环宇铝业有限公司","当涂县",2018,{"$f":"IFERROR(VLOOKUP(B63,#REF!,1,FALSE),\"\")","v":""}]
[62,"马鞍山市粤美金属制品科技实业有限公司","当涂县",2018,{"$f":"IFERROR(VLOOKUP(B64,#REF!,1,FALSE),\"\")","v":""}]
[63,"马鞍山市鑫龙特钢有限公司","当涂县",2018,{"$f":"IFERROR(VLOOKUP(B65,#REF!,1,FALSE),\"\")","v":""}]
[64,"马鞍山市万鑫铸造有限公司","当涂县",2019,{"$f":"IFERROR(VLOOKUP(B66,#REF!,1,FALSE),\"\")","v":""}]
[65,"马鞍山北光冶金机械有限责任公司","当涂县",2019,{"$f":"IFERROR(VLOOKUP(B67,#REF!,1,FALSE),\"\")","v":""}]
[66,"安徽泰恩康制药有限公司","当涂县",2019,{"$f":"IFERROR(VLOOKUP(B68,#REF!,1,FALSE),\"\")","v":""}]
[67,"马鞍山市德善金属成型科技有限公司","当涂县",2019,{"$f":"IFERROR(VLOOKUP(B69,#REF!,1,FALSE),\"\")","v":""}]
[68,"安徽长江精细硅粉有限责任公司","当涂县",2020,{"$f":"IFERROR(VLOOKUP(B70,#REF!,1,FALSE),\"\")","v":""}]
[69,"马鞍山江心绿洲食品有限公司","当涂县",2020,{"$f":"IFERROR(VLOOKUP(B71,#REF!,1,FALSE),\"\")","v":""}]
[70,"安徽省中测电子科技有限公司","当涂县",2021,{"$f":"IFERROR(VLOOKUP(B72,#REF!,1,FALSE),\"\")","v":""}]
[71,"马鞍山宏瑞金属制品有限公司","当涂县",2021,{"$f":"IFERROR(VLOOKUP(B73,#REF!,1,FALSE),\"\")","v":""}]
[72,"马鞍山三塔环保科技有限公司","当涂县",2021,{"$f":"IFERROR(VLOOKUP(B74,#REF!,1,FALSE),\"\")","v":""}]
[73,"东华软件工程有限公司","花山区",2016,{"$f":"IFERROR(VLOOKUP(B75,#REF!,1,FALSE),\"\")","v":""}]
[74,"马鞍山百助网络科技有限公司","花山区",2016,{"$f":"IFERROR(VLOOKUP(B76,#REF!,1,FALSE),\"\")","v":""}]
[75,"卓源信息科技股份有限公司","花山区",2017,{"$f":"IFERROR(VLOOKUP(B77,#REF!,1,FALSE),\"\")","v":""}]
[76,"安徽金禾软件股份有限公司","花山区",2018,{"$f":"IFERROR(VLOOKUP(B78,#REF!,1,FALSE),\"\")","v":""}]
[77,"马鞍山琢学网络科技有限公司","花山区",2018,{"$f":"IFERROR(VLOOKUP(B79,#REF!,1,FALSE),\"\")","v":""}]
[78,"安徽马钢嘉华新型建材有限公司","花山区",2020,{"$f":"IFERROR(VLOOKUP(B80,#REF!,1,FALSE),\"\")","v":""}]
[79,"马鞍山市鑫洋永磁有限责任公司","雨山区",2013,{"$f":"IFERROR(VLOOKUP(B81,#REF!,1,FALSE),\"\")","v":""}]
[80,"安徽天一重工股份有限公司","雨山区",2014,{"$f":"IFERROR(VLOOKUP(B82,#REF!,1,FALSE),\"\")","v":""}]
[81,"安徽华创智能装备有限公司","雨山区",2015,{"$f":"IFERROR(VLOOKUP(B83,#REF!,1,FALSE),\"\")","v":""}]
[82,"马鞍山方宏自动化科技有限公司","雨山区",2015,{"$f":"IFERROR(VLOOKUP(B84,#REF!,1,FALSE),\"\")","v":""}]
[83,"安徽云天冶金科技股份有限公司","雨山区",2016,{"$f":"IFERROR(VLOOKUP(B85,#REF!,1,FALSE),\"\")","v":""}]
[84,"安徽畅感网络科技有限公司","雨山区",2016,{"$f":"IFERROR(VLOOKUP(B86,#REF!,1,FALSE),\"\")","v":""}]
[85,"马鞍山新康达磁业有限公司","雨山区",2016,{"$f":"IFERROR(VLOOKUP(B87,#REF!,1,FALSE),\"\")","v":""}]
[86,"马鞍山市采石矶食品有限公司","雨山区",2016,{"$f":"IFERROR(VLOOKUP(B88,#REF!,1,FALSE),\"\")","v":""}]
[87,"中钢天源（马鞍山）通力磁材有限公司","雨山区",2017,{"$f":"IFERROR(VLOOKUP(B89,#REF!,1,FALSE),\"\")","v":""}]
[88,"马鞍山博宇重机有限公司","雨山区",2017,{"$f":"IFERROR(VLOOKUP(B90,#REF!,1,FALSE),\"\")","v":""}]
[89,"马鞍山市双益机械制造有限公司","雨山区",2017,{"$f":"IFERROR(VLOOKUP(B91,#REF!,1,FALSE),\"\")","v":""}]
[90,"马鞍山市雨山冶金新材料有限公司","雨山区",2017,{"$f":"IFERROR(VLOOKUP(B92,#REF!,1,FALSE),\"\")","v":""}]
[91,"马鞍山中尧网络科技有限公司","雨山区",2017,{"$f":"IFERROR(VLOOKUP(B93,#REF!,1,FALSE),\"\")","v":""}]
[92,"中钢天源股份有限公司","雨山区",2018,{"$f":"IFERROR(VLOOKUP(B94,#REF!,1,FALSE),\"\")","v":""}]
[93,"安徽黄河水处理科技股份有限公司","雨山区",2018,{"$f":"IFERROR(VLOOKUP(B95,#REF!,1,FALSE),\"\")","v":""}]
[94,"安徽旗翔科技发展有限公司","雨山区",2018,{"$f":"IFERROR(VLOOKUP(B96,#REF!,1,FALSE),\"\")","v":""}]
[95,"马鞍山甬兴模塑有限公司","雨山区",2018,{"$f":"IFERROR(VLOOKUP(B97,#REF!,1,FALSE),\"\")","v":""}]
[96,"金雪驰科技（马鞍山）有限公司","雨山区",2018,{"$f":"IFERROR(VLOOKUP(B98,#REF!,1,FALSE),\"\")","v":""}]
[97,"安徽昱工耐磨材料科技有限公司","雨山区",2019,{"$f":"IFERROR(VLOOKUP(B99,#REF!,1,FALSE),\"\")","v":""}]
[98,"马鞍山奥柯环保科技发展有限公司","雨山区",2019,{"$f":"IFERROR(VLOOKUP(B100,#REF!,1,FALSE),\"\")","v":""}]
[99,"安徽晨光高耐磨科技股份有限公司","雨山区",2020,{"$f":"IFERROR(VLOOKUP(B101,#REF!,1,FALSE),\"\")","v":""}]
[100,"安徽港泰机械制造集团有限公司","雨山区",2021,{"$f":"IFERROR(VLOOKUP(B102,#REF!,1,FALSE),\"\")","v":""}]
[101,"安徽省爱夫卡电子科技有限公司","雨山区",2021,{"$f":"IFERROR(VLOOKUP(B103,#REF!,1,FALSE),\"\")","v":""}]
[102,"安徽斯塔克机器人有限公司","雨山区",2021,{"$f":"IFERROR(VLOOKUP(B104,#REF!,1,FALSE),\"\")","v":""}]
[103,"马鞍山市恒利达机械刀片有限公司","博望区",2013,{"$f":"IFERROR(VLOOKUP(B105,#REF!,1,FALSE),\"\")","v":""}]
[104,"安徽东海机床制造有限公司","博望区",2013,{"$f":"IFERROR(VLOOKUP(B106,#REF!,1,FALSE),\"\")","v":""}]
[105,"马鞍山市海天重工科技发展有限公司","博望区",2013,{"$f":"IFERROR(VLOOKUP(B107,#REF!,1,FALSE),\"\")","v":""}]
[106,"安徽联盟模具工业股份有限公司","博望区",2014,{"$f":"IFERROR(VLOOKUP(B108,#REF!,1,FALSE),\"\")","v":""}]
[107,"安徽省凌锋冶金机械有限公司","博望区",2014,{"$f":"IFERROR(VLOOKUP(B109,#REF!,1,FALSE),\"\")","v":""}]
[108,"马鞍山金泉工业介质科技有限公司","博望区",2015,{"$f":"IFERROR(VLOOKUP(B110,#REF!,1,FALSE),\"\")","v":""}]
[109,"安徽力源数控刃模具制造有限公司","博望区",2015,{"$f":"IFERROR(VLOOKUP(B111,#REF!,1,FALSE),\"\")","v":""}]
[110,"马鞍山金姿纺织装饰用品有限公司","博望区",2015,{"$f":"IFERROR(VLOOKUP(B112,#REF!,1,FALSE),\"\")","v":""}]
[111,"安徽华天机械股份有限公司","博望区",2016,{"$f":"IFERROR(VLOOKUP(B113,#REF!,1,FALSE),\"\")","v":""}]
[112,"马鞍山市恒久特材有限公司","博望区",2016,{"$f":"IFERROR(VLOOKUP(B114,#REF!,1,FALSE),\"\")","v":""}]
[113,"技锋精密刀具（马鞍山）有限公司","博望区",2016,{"$f":"IFERROR(VLOOKUP(B115,#REF!,1,FALSE),\"\")","v":""}]
[114,"安徽中德机床股份有限公司","博望区",2017,{"$f":"IFERROR(VLOOKUP(B116,#REF!,1,FALSE),\"\")","v":""}]
[115,"安徽省亚威机床制造有限公司","博望区",2017,{"$f":"IFERROR(VLOOKUP(B117,#REF!,1,FALSE),\"\")","v":""}]
[116,"安徽莱特气弹簧有限公司","博望区",2017,{"$f":"IFERROR(VLOOKUP(B118,#REF!,1,FALSE),\"\")","v":""}]
[117,"马鞍山市伟泰锡业有限公司","博望区",2017,{"$f":"IFERROR(VLOOKUP(B119,#REF!,1,FALSE),\"\")","v":""}]
[118,"马鞍山市宏达保温材料有限公司","博望区",2017,{"$f":"IFERROR(VLOOKUP(B120,#REF!,1,FALSE),\"\")","v":""}]
{"$rows_left_out":80}
{"sheet":"省专精特新冠军","index":2,"n_rows":13,"n_cols":4,"rows_kept":13,"merged":[[0,0,0,3]]}
["安徽省专精特新冠军企业名单"]
["序号","企业名称","所在县区","评选年度"]
[1,"同兴环保科技股份有限公司","含山县",2020]
[2,"三联泵业股份有限公司","和县",2020]
[3,"安徽桑瑞斯环保新材料有限公司","当涂县",2020]
[4,"金菜地食品股份有限公司","当涂县",2021]
[5,"马鞍山百助网络科技有限公司","花山区",2020]
[6,"马鞍山市恒利达机械刀片有限公司","博望区",2021]
[7,"马鞍山金泉工业介质科技有限公司","博望区",2021]
[8,"马鞍山方圆精密机械有限公司","市经开区",2020]
[9,"安徽华骐环保科技股份有限公司","市经开区",2020]
[10,"马鞍山利尔开元新材料有限公司","市经开区",2021]
[11,"马鞍山市兴达冶金新材料有限公司","慈湖高新区",2021]

{"sheet":"国家专精特新“小巨人”","index":3,"n_rows":15,"n_cols":7,"rows_kept":15,"merged":[[0,0,0,4]]}
["国家专精特新“小巨人”"]
["序号","企业名称","所在县区","主导产品","评选年度","是否重点小巨人","批次"]
[1,"三联泵业股份有限公司","和县","百万机组气脱硫泵",2021,null,"第三批"]
[2,"安徽禾臣新材料有限公司","和县","吸附垫",2021,null,"第三批"]
[3,"马鞍山采石矶涂料有限公司","当涂县","环氧富锌漆",2021,"重点2","第三批"]
[4,"安徽天一重工股份有限公司","雨山区","盾构机刀具",2020,"重点1","第二批"]
[5,"安徽东海机床制造有限公司","博望区","折弯机",2020,"重点1","第二批"]
[6,"马鞍山市中亚机床制造有限公司","博望区","各类高智控数控折弯机、剪板机、高速激光切割机",2021,null,"第三批"]
[7,"安徽联盟模具工业股份有限公司","博望区","钣金折弯模具",2021,null,"第三批"]
[8,"马鞍山市海天重工科技发展有限公司","博望区","混凝土搅拌车耐磨铸件",2021,null,"第三批"]
[9,"安徽科达机电有限公司","经开区","新型建材机械装备",2021,null,"第三批"]
[10,"马鞍山方圆精密机械有限公司","经开区","回转支承",2021,null,"第三批"]
[11,"安徽华骐环保科技股份有限公司","经开区","智能污水处理设备",2021,null,"第三批"]
[12,"安徽欣创节能环保科技股份有限公司","经开区","脱硫脱硝系统",2021,null,"第三批"]
[13,"马鞍山宏力橡胶制品有限公司","慈湖高新区","止脱橡胶密封圈",2020,"重点2","第二批"]